1. ScarletDreamz

    OP ScarletDreamz [Debug Mode]
    Member

    Joined:
    Feb 16, 2015
    Messages:
    3,934
    Country:
    United States
    Sup everybody, asked already on the main topic, so migh as well ask it here:

    Does anyone have errors compiling the source? each time i try to compile it i get this:

    c:/Users/Admin/Desktop/Sources/snes9x_3ds/source/3dsmain.cpp: In function 'void menuSelectFile()':
    c:/Users/Admin/Desktop/Sources/snes9x_3ds/source/3dsmain.cpp:1326:9: error: 'APT_AppStatus' was not declared in this scope
    APT_AppStatus appStatus = aptGetStatus();
    ^~~~~~~~~~~~~
    c:/Users/Admin/Desktop/Sources/snes9x_3ds/source/3dsmain.cpp:1327:13: error: 'appStatus' was not declared in this scope
    if (appStatus == APP_EXITING)
    ^~~~~~~~~
    c:/Users/Admin/Desktop/Sources/snes9x_3ds/source/3dsmain.cpp:1327:26: error: 'APP_EXITING' was not declared in this scope
    if (appStatus == APP_EXITING)
    ^~~~~~~~~~~
    c:/Users/Admin/Desktop/Sources/snes9x_3ds/source/3dsmain.cpp: In function 'void menuPause()':
    c:/Users/Admin/Desktop/Sources/snes9x_3ds/source/3dsmain.cpp:1411:9: error: 'APT_AppStatus' was not declared in this scope
    APT_AppStatus appStatus = aptGetStatus();
    ^~~~~~~~~~~~~
    c:/Users/Admin/Desktop/Sources/snes9x_3ds/source/3dsmain.cpp:1412:13: error: 'appStatus' was not declared in this scope
    if (appStatus == APP_EXITING)
    ^~~~~~~~~
    c:/Users/Admin/Desktop/Sources/snes9x_3ds/source/3dsmain.cpp:1412:26: error: 'APP_EXITING' was not declared in this scope
    if (appStatus == APP_EXITING)
    ^~~~~~~~~~~
    c:/Users/Admin/Desktop/Sources/snes9x_3ds/source/3dsmain.cpp: In function 'void snesEmulatorLoop()':
    c:/Users/Admin/Desktop/Sources/snes9x_3ds/source/3dsmain.cpp:1947:9: error: 'APT_AppStatus' was not declared in this scope
    APT_AppStatus appStatus = aptGetStatus();
    ^~~~~~~~~~~~~
    c:/Users/Admin/Desktop/Sources/snes9x_3ds/source/3dsmain.cpp:1948:13: error: 'appStatus' was not declared in this scope
    if (appStatus == APP_EXITING)
    ^~~~~~~~~
    c:/Users/Admin/Desktop/Sources/snes9x_3ds/source/3dsmain.cpp:1948:26: error: 'APP_EXITING' was not declared in this scope
    if (appStatus == APP_EXITING)
    ^~~~~~~~~~~
    c:/Users/Admin/Desktop/Sources/snes9x_3ds/source/3dsmain.cpp: In function 'int main()':
    c:/Users/Admin/Desktop/Sources/snes9x_3ds/source/3dsmain.cpp:2537:9: error: 'APT_AppStatus' was not declared in this scope
    APT_AppStatus appStatus = aptGetStatus();
    ^~~~~~~~~~~~~
    c:/Users/Admin/Desktop/Sources/snes9x_3ds/source/3dsmain.cpp:2538:13: error: 'appStatus' was not declared in this scope
    if (appStatus == APP_EXITING)
    ^~~~~~~~~
    c:/Users/Admin/Desktop/Sources/snes9x_3ds/source/3dsmain.cpp:2538:26: error: 'APP_EXITING' was not declared in this scope
    if (appStatus == APP_EXITING)
    ^~~~~~~~~~~
    make[1]: *** [3dsmain.o] Error 1
    make: *** [build] Error 2

    Already tried to compile it from different releases, cloning the master branch, and declared the appStatus before the "{}" symbols,

    Anyone got a hint on this?
     
Draft saved Draft deleted
Loading...

Hide similar threads Similar threads with keywords - Compiling, [Snex9X], Snes9x