StickerHax EUR: PowerSave backup request, and help for build it.

Discussion in '3DS - Homebrew Development and Emulators' started by Asia81, Nov 8, 2016.

Thread Status:
Not open for further replies.
  1. Asia81
    OP

    Asia81 In my Ecchi World <3

    Member
    12
    Nov 15, 2014
    France
    Albi
    For of all, can someone send me a powersave backup file for stickerhax eur?
    I have a powersave and PM Sticker Star EUR.
    The OldDDS is in 9.8.

    Then.
    I'm trying to build StickerHax, but I got some errors.
    I'm using this make command:
    Code:
    make clean ROPKIT_PATH={https://github.com/yellows8/3ds_ropkit} && make ROPKIT_PATH={https://github.com/yellows8/3ds_ropkit}
    And the errors I got:
    Code:
    C:\Users\Asia81\Downloads\Compressed\StickerHax>make clean ROPKIT_PATH={https://github.com/yellows8/3ds_ropkit} && make ROPKIT_PATH={https://github.com/yellows8/3ds_ropkit}
    built ... sploit_installer_stickerhax.smdh
    Building for title 00040000000a5d00...
    Building v1.0_JPN...
    stickerhax.s:13:31: fatal error: ropkit_ropinclude.s: No such file or directory
    compilation terminated.
    make[2]: *** [build/v1.0_JPN.elf] Error 1
    make[1]: *** [build_savedata] Error 2
    Building for title 00040000000a5e00...
    Building v1.0_USA...
    stickerhax.s:13:31: fatal error: ropkit_ropinclude.s: No such file or directory
    compilation terminated.
    make[2]: *** [build/v1.0_USA.elf] Error 1
    make[1]: *** [build_savedata] Error 2
    Building for title 00040000000a5f00...
    Building v1.0_EUR...
    stickerhax.s:13:31: fatal error: ropkit_ropinclude.s: No such file or directory
    compilation terminated.
    make[2]: *** [build/v1.0_EUR.elf] Error 1
    make[1]: *** [build_savedata] Error 2
    Building for title 00040000000c6800...
    Building v1.0_KOR...
    stickerhax.s:13:31: fatal error: ropkit_ropinclude.s: No such file or directory
    compilation terminated.
    make[2]: *** [build/v1.0_KOR.elf] Error 1
    make[1]: *** [build_savedata] Error 2
    Building for title 00040000000c8100...
    Building v1.0_CHNTWN...
    stickerhax.s:13:31: fatal error: ropkit_ropinclude.s: No such file or directory
    compilation terminated.
    make[2]: *** [build/v1.0_CHNTWN.elf] Error 1
    make[1]: *** [build_savedata] Error 2
    make: *** [all] Error 2
     
  2. raulpica

    raulpica With your drill, thrust to the sky!

    Supervisor
    16
    Oct 23, 2007
    Italy
    PowerLevel: 9001
    OP requested lock.
     
Loading...
Thread Status:
Not open for further replies.
  1. This site uses cookies to help personalise content, tailor your experience and to keep you logged in if you register.
    By continuing to use this site, you are consenting to our use of cookies.
    Dismiss Notice