compile problem

Discussion in 'Wii - Hacking' started by PhyniX, Oct 12, 2009.

Oct 12, 2009

compile problem by PhyniX at 10:32 PM (495 Views / 0 Likes) 0 replies

  1. PhyniX
    OP

    Newcomer PhyniX Advanced Member

    Joined:
    Mar 29, 2009
    Messages:
    79
    Country:
    Germany
    Hello i want compile the USB Loader GX
    but a have follow error
    pleace help me :-)

    FreeTypeGX.cpp
    c:/devkitPro/examples/usbloader/source/FreeTypeGX.cpp: In member function 'uint16_t FreeTypeGX::drawText(int16_t, int16_t, wchar_t*, GXColor, uint16_t)':
    c:/devkitPro/examples/usbloader/source/FreeTypeGX.cpp:540: error: 'wcslen' was not declared in this scope
    c:/devkitPro/examples/usbloader/source/FreeTypeGX.cpp: In member function 'uint16_t FreeTypeGX::getWidth(wchar_t*)':
    c:/devkitPro/examples/usbloader/source/FreeTypeGX.cpp:645: error: 'wcslen' was not declared in this scope
    c:/devkitPro/examples/usbloader/source/FreeTypeGX.cpp: In member function 'ftgxDataOffset* FreeTypeGX::getOffset(wchar_t*, ftgxDataOffset*)':
    c:/devkitPro/examples/usbloader/source/FreeTypeGX.cpp:714: error: 'wcslen' was not declared in this scope
    make[1]: *** [FreeTypeGX.o] Error 1
    "make": *** [build] Error 2

    > Process Exit Code: 2
    > Time Taken: 00:03
     

Share This Page